﻿ContractedPBMName,ContractedPBMLicenseID,ServicingPBMName,InsurerCode,PlanType,RxFillNum,CompoundInd,IngredientNo,NDCNo,DrugName,DrugStrength,DrugStrengthMetricUnit,GPICode,GPIDesc,DrugFillDate,QtyFilled,QtyFillUnit,ProviderIdNo,ProviderIdQual,PTypeCode,PName,PAddress,PCity,PState,PZip,PharmAffil,PricingMeth,IngredientCost,AvgNADACCost,ReimbPercentNADAC
CerpassRx,,,,OTH,5,N,0,3089421,Eliquis Oral Tablet 5 MG,5MG,,8.337E+13,APIXABAN TAB 5 MG,5/1/2022,60,,1150212,7,C,PUBLIX PHARMACY #0853,6320 LAKE OCONEE PARKWAY,GREENSBORO,GA,30642,N,AWP,499.91,8.46451,-0.01567
CerpassRx,,,,OTH,6,N,0,68180072103,amLODIPine Besylate Oral Tablet 10 MG,10MG,,3.4E+13,AMLODIPINE BESYLATE TAB 10 MG (BASE EQUIVALENT),5/1/2022,30,,1156290,7,C,WALGREENS #10799,409 S COLUMBIA AVE,RINCON,GA,313269080,N,AWP,14.15,0.01687,26.9589
CerpassRx,,,,OTH,1,N,0,378623201,Citalopram Hydrobromide Oral Tablet 20 MG,20MG,,5.816E+13,CITALOPRAM HYDROBROMIDE TAB 20 MG (BASE EQUIV),5/1/2022,30,,1151985,7,C,WALGREENS #2455,2580 SANDY PLAINS RD,MARIETTA,GA,300665798,N,AWP,15.22,0.02946,16.22109
CerpassRx,,,,OTH,2,N,0,70436001102,buPROPion HCl ER (XL) Oral Tablet Extended Release,300MG,,5.83E+13,BUPROPION HCL TAB ER 24HR 300 MG,5/1/2022,30,,1146958,7,C,CVS PHARMACY #16887,1135 WOODSTOCK RD,ROSWELL,GA,30075,N,AWP,26.82,0.18442,3.84763
CerpassRx,,,,OTH,2,N,0,70436001002,buPROPion HCl ER (XL) Oral Tablet Extended Release,150MG,,5.83E+13,BUPROPION HCL TAB ER 24HR 150 MG,5/1/2022,30,,1146958,7,C,CVS PHARMACY #16887,1135 WOODSTOCK RD,ROSWELL,GA,30075,N,AWP,22.49,0.1335,4.61548
CerpassRx,,,,OTH,4,N,0,69452023320,Progesterone Oral Capsule 100 MG,100MG,,2.6E+13,PROGESTERONE CAP 100 MG,5/1/2022,30,,1146958,7,C,CVS PHARMACY #16887,1135 WOODSTOCK RD,ROSWELL,GA,30075,N,AWP,10.44,0.25967,0.34016
CerpassRx,,,,OTH,3,N,0,70377000712,Rosuvastatin Calcium Oral Tablet 10 MG,10MG,,3.94001E+13,ROSUVASTATIN CALCIUM TAB 10 MG,5/1/2022,30,,1146958,7,C,CVS PHARMACY #16887,1135 WOODSTOCK RD,ROSWELL,GA,30075,N,AWP,45.56,0.05981,24.39152
CerpassRx,,,,OTH,0,N,0,45802014167,Ciclopirox External Solution 8 %,8%,,9.015E+13,CICLOPIROX SOLUTION 8%,5/1/2022,6.6,,1146263,7,C,KROGER DRUGSTORE #491,3871 PEACHTREE ROAD NE,ATLANTA,GA,30319,N,MAC,16.94,1.90189,0.34953
CerpassRx,,,,OTH,2,N,0,47781066290,Levothyroxine Sodium Oral Tablet 150 MCG,150MCG,,2.81E+13,LEVOTHYROXINE SODIUM TAB 150 MCG,5/1/2022,30,,1150212,7,C,PUBLIX PHARMACY #0853,6320 LAKE OCONEE PARKWAY,GREENSBORO,GA,30642,N,MAC,9.21,0.21406,0.43418
CerpassRx,,,,OTH,2,N,0,70010014805,Potassium Chloride ER Oral Capsule Extended Releas,10MEQ,,7.97E+13,POTASSIUM CHLORIDE CAP ER 10 MEQ,5/1/2022,120,,1150212,7,C,PUBLIX PHARMACY #0853,6320 LAKE OCONEE PARKWAY,GREENSBORO,GA,30642,N,MAC,24.5,0.15494,0.31771
CerpassRx,,,,OTH,3,N,0,72205000390,Rosuvastatin Calcium Oral Tablet 10 MG,10MG,,3.94001E+13,ROSUVASTATIN CALCIUM TAB 10 MG,5/1/2022,15,,1150212,7,C,PUBLIX PHARMACY #0853,6320 LAKE OCONEE PARKWAY,GREENSBORO,GA,30642,N,MAC,2.21,0.05981,1.46336
CerpassRx,,,,OTH,1,N,0,33342018010,Olmesartan Medoxomil Oral Tablet 40 MG,40MG,,3.61501E+13,OLMESARTAN MEDOXOMIL TAB 40 MG,5/1/2022,30,,1131527,7,C,CVS PHARMACY #07758,410 S COLUMBIA AVE,RINCON,GA,31326,N,AWP,44.51,0.15714,8.44169
CerpassRx,,,,OTH,2,N,0,378064110,predniSONE Oral Tablet 10 MG,10MG,,2.21E+13,PREDNISONE TAB 10 MG,5/1/2022,30,,1144409,7,C,CVS PHARMACY #02236,1600 TOWNE LAKE PKWY,WOODSTOCK,GA,30189,N,AWP,1.06,0.07092,-0.50179
CerpassRx,,,,OTH,1,N,0,50742061610,Metoprolol Succinate ER Oral Tablet Extended Relea,50MG,,3.32E+13,METOPROLOL SUCCINATE TAB ER 24HR 50 MG (TARTRATE EQUIV),5/1/2022,60,,1144409,7,C,CVS PHARMACY #02236,1600 TOWNE LAKE PKWY,WOODSTOCK,GA,30189,N,AWP,12.52,0.10316,1.02275
CerpassRx,,,,OTH,7,N,0,13668013601,Escitalopram Oxalate Oral Tablet 10 MG,10MG,,5.816E+13,ESCITALOPRAM OXALATE TAB 10 MG (BASE EQUIV),5/2/2022,30,,1136058,7,C,CVS PHARMACY #04723,439 HIGHLAND AVE NE,ATLANTA,GA,30312,N,AWP,22.07,0.04972,13.79619
CerpassRx,,,,OTH,0,N,0,65862052305,Gabapentin Oral Tablet 600 MG,600MG,,7.26E+13,GABAPENTIN TAB 600 MG,5/2/2022,90,,1102285,7,C,CVS PHARMACY #03776,232 ELBERT ST,ELBERTON,GA,30635,N,AWP,38.65,0.0921,3.66281
CerpassRx,,,,OTH,0,N,0,68180013601,Escitalopram Oxalate Oral Tablet 20 MG,20MG,,5.816E+13,ESCITALOPRAM OXALATE TAB 20 MG (BASE EQUIV),5/2/2022,30,,1151985,7,C,WALGREENS #2455,2580 SANDY PLAINS RD,MARIETTA,GA,300665798,N,AWP,29.3,0.07845,11.44954
CerpassRx,,,,OTH,0,N,0,68180032002,buPROPion HCl ER (XL) Oral Tablet Extended Release,300MG,,5.83E+13,BUPROPION HCL TAB ER 24HR 300 MG,5/2/2022,30,,1151985,7,C,WALGREENS #2455,2580 SANDY PLAINS RD,MARIETTA,GA,300665798,N,AWP,28.39,0.18442,4.1314
CerpassRx,,,,OTH,3,N,0,65862046990,Losartan Potassium-HCTZ Oral Tablet 100-12.5 MG,100-12.5MG,,3.6994E+13,LOSARTAN POTASSIUM & HYDROCHLOROTHIAZIDE TAB 100-12.5 MG,5/2/2022,30,,1117185,7,C,THOMAS DRUGS,2704 JEFFERSON ST,AUSTELL,GA,30168,N,MAC,9.02,0.20878,0.44011
CerpassRx,,,,OTH,0,N,0,16714094801,Amphetamine-Dextroamphetamine Oral Tablet 5 MG,5MG,,6.11099E+13,AMPHETAMINE-DEXTROAMPHETAMINE TAB 5 MG,5/2/2022,60,,1117185,7,C,THOMAS DRUGS,2704 JEFFERSON ST,AUSTELL,GA,30168,N,MAC,17.72,0.21985,0.34334
CerpassRx,,,,OTH,0,N,0,65862018601,Clindamycin HCl Oral Capsule 300 MG,300MG,,1.622E+13,CLINDAMYCIN HCL CAP 300 MG,5/2/2022,30,,1162471,7,C,CHANCY DRUGS VALDOSTA LLC,2333 N ASHLEY ST,VALDOSTA,GA,316022621,N,MAC,6.68,0.25846,-0.13849
CerpassRx,,,,OTH,8,N,0,2318280,Trulicity Subcutaneous Solution Pen-injector 4.5 M,4.5MG/0.5ML,,2717001500D250,DULAGLUTIDE SOLN PEN-INJECTOR 4.5 MG/0.5ML,5/2/2022,2,,1163459,7,C,UNADILLA DRUG COMPANY,413 SECOND ST,UNADILLA,GA,31091,N,AWP,901.1,426.09504,0.05739
CerpassRx,,,,OTH,0,N,0,555902858,Junel FE 1.5/30 Oral Tablet 1.5-30 MG-MCG,1.5-30MG-MCG,,2.599E+13,NORETHINDRONE ACE & ETHINYL ESTRADIOL-FE TAB 1.5 MG-30 MCG,5/2/2022,28,,1158408,7,C,CVS PHARMACY #05418,1905 MARTHA BERRY BLVD,ROME,GA,301651649,N,AWP,4.92,0.28591,-0.38542
CerpassRx,,,,OTH,2,N,0,93342510,LORazepam Oral Tablet 0.5 MG,0.5MG,,5.71001E+13,LORAZEPAM TAB 0.5 MG,5/2/2022,60,,1163459,7,C,UNADILLA DRUG COMPANY,413 SECOND ST,UNADILLA,GA,31091,N,MAC,9.65,0.03794,3.23915
CerpassRx,,,,OTH,5,N,0,70069000510,Cyanocobalamin Injection Solution 1000 MCG/ML,1000MCG/ML,,8.21E+13,CYANOCOBALAMIN INJ 1000 MCG/ML,5/2/2022,1,,1163459,7,C,UNADILLA DRUG COMPANY,413 SECOND ST,UNADILLA,GA,31091,N,AWP,3.34,2.89168,0.15504
CerpassRx,,,,OTH,1,N,0,65862052890,Venlafaxine HCl ER Oral Capsule Extended Release 2,75MG,,5.81801E+13,VENLAFAXINE HCL CAP ER 24HR 75 MG (BASE EQUIVALENT),5/2/2022,90,,1160706,7,C,PUBLIX PHARMACY #1291,6015 WATSON BLVD.,BYRON,GA,31008,N,MAC,16.64,0.12722,0.4533
CerpassRx,,,,OTH,1,N,0,69315090510,LORazepam Oral Tablet 1 MG,1MG,,5.71001E+13,LORAZEPAM TAB 1 MG,5/2/2022,30,,1162495,7,C,INGLES PHARMACY,1441 EATONTON RD,MADISON,GA,306504630,N,MAC,4.06,0.04593,1.94651
CerpassRx,,,,OTH,0,N,0,527458037,Methylphenidate HCl ER (CD) Oral Capsule Extended ,20MG,,6.14E+13,METHYLPHENIDATE HCL CAP ER 20 MG (CD),5/2/2022,30,,1156288,7,C,WALGREENS #10423,3290 KEITH BRIDGE RD,CUMMING,GA,300413937,N,AWP,34.37,1.42341,-0.19513
CerpassRx,,,,OTH,0,N,0,65038042999,Azstarys Oral Capsule 39.2-7.8 MG,39.2-7.8MG,,6.14098E+13,SERDEXMETHYLPHENIDATE-DEXMETHYLPHENIDATE CAP 39.2-7.8 MG,5/2/2022,30,,1164956,7,C,HARVEYS SUPERMARKET,813 S PETERSON AVE,DOUGLAS,GA,31533,N,AWP,372.68,,
CerpassRx,,,,OTH,1,N,0,24208053708,Lumify Ophthalmic Solution 0.025 %,0.03%,,8.6602E+13,BRIMONIDINE TARTRATE OPHTH SOLN 0.025%,5/2/2022,2.5,,1158131,7,C,WALGREENS #12319,126 BROAD ST,HAWKINSVILLE,GA,310364815,N,AWP,7.72,2.9888,0.03319
CerpassRx,,,,OTH,0,N,0,781261305,Amoxicillin Oral Capsule 500 MG,500MG,,1.20001E+12,AMOXICILLIN (TRIHYDRATE) CAP 500 MG,5/2/2022,12,,1123657,7,C,COASTAL DRUG COMPANY,204 BUTLER STREET,MIDWAY,GA,31320,N,MAC,0.85,0.07054,0.00416
CerpassRx,,,,OTH,0,N,0,50111056101,traZODone HCl Oral Tablet 100 MG,100MG,,5.81201E+13,TRAZODONE HCL TAB 100 MG,5/2/2022,30,,1127681,7,C,CVS PHARMACY #04206,2700 OSBORNE RD,SAINT MARYS,GA,31558,N,AWP,7.1,0.07015,2.37372
CerpassRx,,,,OTH,1,N,0,53746051401,Spironolactone Oral Tablet 50 MG,50MG,,3.75E+13,SPIRONOLACTONE TAB 50 MG,5/2/2022,60,,1133747,7,C,CVS PHARMACY #04665,3401 NSIDE PKWY NW,ATLANTA,GA,30327,N,AWP,8.33,0.12042,0.15291
CerpassRx,,,,OTH,3,N,0,49483048110,Aspirin Low Dose Oral Tablet Delayed Release 81 MG,81MG,,6.41E+13,ASPIRIN TAB DELAYED RELEASE 81 MG,5/3/2022,30,,1139674,7,C,PUBLIX PHARMACY #0451,3620 ATLANTA HWY,ATHENS,GA,30606,N,AWP,0.18,0.01442,-0.58391
CerpassRx,,,,OTH,0,N,0,47781030301,Nitrofurantoin Monohyd Macro Oral Capsule 100 MG,100MG,,1.68001E+13,NITROFURANTOIN MONOHYDRATE MACROCRYSTALLINE CAP 100 MG,5/3/2022,10,,1101790,7,C,CVS PHARMACY #04190,959 BIG A RD,TOCCOA,GA,30577,N,AWP,6.48,0.48495,0.33622
CerpassRx,,,,OTH,2,N,0,62756001540,Testosterone Cypionate Intramuscular Solution 200 ,200MG/ML,,2.31E+13,TESTOSTERONE CYPIONATE IM INJ IN OIL 200 MG/ML,5/3/2022,2,,1175175,7,C,MILLER PHARMACY,213 DELORES STREET,COLQUITT,GA,39837,N,MAC,25.03,15.53502,-0.1944
CerpassRx,,,,OTH,0,N,0,406114601,Methylphenidate HCl Oral Tablet 20 MG,20MG,,6.14E+13,METHYLPHENIDATE HCL TAB 20 MG,5/3/2022,15,,1156288,7,C,WALGREENS #10423,3290 KEITH BRIDGE RD,CUMMING,GA,300413937,N,AWP,4.46,0.22814,0.30329
CerpassRx,,,,OTH,3,N,0,31722070090,Losartan Potassium Oral Tablet 25 MG,25MG,,3.615E+13,LOSARTAN POTASSIUM TAB 25 MG,5/3/2022,30,,1170175,7,C,HIAWASSEE HOMETOWN PHARMACY,230 CHATUGE WAY,HIAWASSEE,GA,305463438,N,MAC,3.61,0.0613,0.96302
CerpassRx,,,,OTH,0,N,0,57237021330,Montelukast Sodium Oral Tablet Chewable 5 MG,5MG,,4.45051E+13,MONTELUKAST SODIUM CHEW TAB 5 MG (BASE EQUIV),5/3/2022,30,,1157177,7,C,WALGREENS #11661,602 PETERSON AVE S,DOUGLAS,GA,315335233,N,AWP,29.95,0.08451,10.8132
CerpassRx,,,,OTH,0,N,0,70069013101,Tobramycin Ophthalmic Solution 0.3 %,0.30%,,8.61011E+13,TOBRAMYCIN OPHTH SOLN 0.3%,5/3/2022,5,,1157177,7,C,WALGREENS #11661,602 PETERSON AVE S,DOUGLAS,GA,315335233,N,AWP,1.24,1.42908,-0.82646
CerpassRx,,,,OTH,2,N,0,16729044416,buPROPion HCl ER (XL) Oral Tablet Extended Release,300MG,,5.83E+13,BUPROPION HCL TAB ER 24HR 300 MG,5/3/2022,30,,1104075,7,C,HINESVILLE PHARMACY,481 ELMA G MILES PKWY,HINESVILLE,GA,313133615,N,MAC,8.04,0.18442,0.4532
CerpassRx,,,,OTH,0,N,0,50383004248,prednisoLONE Oral Solution 15 MG/5ML,15MG/5ML,,2.21E+13,PREDNISOLONE SOLN 15 MG/5ML,5/3/2022,70,,1157177,7,C,WALGREENS #11661,602 PETERSON AVE S,DOUGLAS,GA,315335233,N,AWP,5.36,0.14379,-0.46748
CerpassRx,,,,OTH,0,N,0,31722095401,Methylphenidate HCl ER Oral Tablet Extended Releas,36MG,,6.14E+13,METHYLPHENIDATE HCL TAB ER OSMOTIC RELEASE (OSM) 36 MG,5/3/2022,30,,1104075,7,C,HINESVILLE PHARMACY,481 ELMA G MILES PKWY,HINESVILLE,GA,313133615,N,MAC,42.36,0.76999,0.83379
CerpassRx,,,,OTH,0,N,0,93227534,Amoxicillin-Pot Clavulanate Oral Tablet 875-125 MG,875-125MG,,1.99E+12,AMOXICILLIN & K CLAVULANATE TAB 875-125 MG,5/3/2022,14,,1154537,7,C,INGLES PHARMACY,283 N BROAD ST,WINDER,GA,30680,N,MAC,7.49,0.32484,0.64696
CerpassRx,,,,OTH,0,N,0,67877041305,metFORMIN HCl ER Oral Tablet Extended Release 24 H,500MG,,2.72501E+13,METFORMIN HCL TAB ER 24HR 500 MG,5/3/2022,120,,1144322,7,C,WINN DIXIE,4231 MACON RD,COLUMBUS,GA,31907,N,U&C,8,0.03646,0.82849
CerpassRx,,,,OTH,0,N,0,70436001102,buPROPion HCl ER (XL) Oral Tablet Extended Release,300MG,,5.83E+13,BUPROPION HCL TAB ER 24HR 300 MG,5/3/2022,30,,1175175,7,C,MILLER PHARMACY,213 DELORES STREET,COLQUITT,GA,39837,N,MAC,8.04,0.18442,0.4532
CerpassRx,,,,OTH,4,N,0,16714004107,Allopurinol Oral Tablet 100 MG,100MG,,6.8E+13,ALLOPURINOL TAB 100 MG,5/3/2022,30,,1165275,7,C,WALMART PHARMACY 10-7246,366 HWY 26 E,COCHRAN,GA,310146049,N,AWP,0.87,0.05549,-0.47738
CerpassRx,,,,OTH,0,N,0,10702010701,Dexmethylphenidate HCl Oral Tablet 5 MG,5MG,,6.14E+13,DEXMETHYLPHENIDATE HCL TAB 5 MG,5/3/2022,60,,1157379,7,C,WALGREENS #10265,4535 ROSWELL RD NE,ATLANTA,GA,303423100,N,AWP,11.6,0.16938,0.14142
CerpassRx,,,,OTH,0,N,0,57599080300,FreeStyle Libre 2 Reader  Device,,,9.7202E+13,*CONTINUOUS BLOOD GLUCOSE SYSTEM RECEIVER***,5/3/2022,1,,1144322,7,C,WINN DIXIE,4231 MACON RD,COLUMBUS,GA,31907,N,AWP,67.41,,
CerpassRx,,,,OTH,0,N,0,185012201,Nitrofurantoin Monohyd Macro Oral Capsule 100 MG,100MG,,1.68001E+13,NITROFURANTOIN MONOHYDRATE MACROCRYSTALLINE CAP 100 MG,5/3/2022,14,,1151985,7,C,WALGREENS #2455,2580 SANDY PLAINS RD,MARIETTA,GA,300665798,N,AWP,8.92,0.48495,0.31383
CerpassRx,,,,OTH,0,N,0,57599080000,FreeStyle Libre 2 Sensor  Miscellaneous,,,9.7202E+13,*CONTINUOUS BLOOD GLUCOSE SYSTEM SENSOR***,5/3/2022,2,,1144322,7,C,WINN DIXIE,4231 MACON RD,COLUMBUS,GA,31907,N,AWP,117.79,,
CerpassRx,,,,OTH,1,N,0,67877056110,metFORMIN HCl Oral Tablet 500 MG,500MG,,2.72501E+13,METFORMIN HCL TAB 500 MG,5/3/2022,60,,1133735,7,C,CVS PHARMACY #05411,3788 ROSWELL RD NE STE F100,SANDY SPRINGS,GA,303424417,N,AWP,7.19,0.01696,6.06564
CerpassRx,,,,OTH,1,N,0,16714085402,Metoprolol Succinate ER Oral Tablet Extended Relea,100MG,,3.32E+13,METOPROLOL SUCCINATE TAB ER 24HR 100 MG (TARTRATE EQUIV),5/3/2022,30,,1155527,7,C,NICHOLLS PHARMACY LLC,1003 VAN STREAT HWY,NICHOLLS,GA,31554,N,MAC,3.97,0.16108,-0.17846
CerpassRx,,,,OTH,0,N,0,16714073302,Celecoxib Oral Capsule 200 MG,200MG,,6.61005E+13,CELECOXIB CAP 200 MG,5/3/2022,30,,1155527,7,C,NICHOLLS PHARMACY LLC,1003 VAN STREAT HWY,NICHOLLS,GA,31554,N,MAC,6.44,0.13496,0.59059
CerpassRx,,,,OTH,0,N,0,16714072203,FLUoxetine HCl Oral Capsule 40 MG,40MG,,5.816E+13,FLUOXETINE HCL CAP 40 MG,5/3/2022,30,,1155527,7,C,NICHOLLS PHARMACY LLC,1003 VAN STREAT HWY,NICHOLLS,GA,31554,N,MAC,4.87,0.08204,0.97871
CerpassRx,,,,OTH,0,N,0,16714074703,Omeprazole Oral Capsule Delayed Release 20 MG,20MG,,4.92701E+13,OMEPRAZOLE CAP DELAYED RELEASE 20 MG,5/3/2022,30,,1155527,7,C,NICHOLLS PHARMACY LLC,1003 VAN STREAT HWY,NICHOLLS,GA,31554,N,MAC,3.98,,
CerpassRx,,,,OTH,0,N,0,43598016430,OLANZapine Oral Tablet 5 MG,5MG,,5.91571E+13,OLANZAPINE TAB 5 MG,5/3/2022,30,,1155527,7,C,NICHOLLS PHARMACY LLC,1003 VAN STREAT HWY,NICHOLLS,GA,31554,N,MAC,7.31,0.09455,1.57712
CerpassRx,,,,OTH,0,N,0,555089902,Estradiol Oral Tablet 0.5 MG,0.5MG,,2.4E+13,ESTRADIOL TAB 0.5 MG,5/3/2022,30,,1155527,7,C,NICHOLLS PHARMACY LLC,1003 VAN STREAT HWY,NICHOLLS,GA,31554,N,MAC,5.53,0.08676,1.12464
CerpassRx,,,,OTH,0,N,0,31722018701,Amphetamine-Dextroamphet ER Oral Capsule Extended ,15MG,,6.11099E+13,AMPHETAMINE-DEXTROAMPHETAMINE CAP ER 24HR 15 MG,5/3/2022,30,,1100596,7,C,CVS PHARMACY #04257,712 STEPHENSON AVE,SAVANNAH,GA,31405,N,AWP,31.27,0.55636,0.87349
CerpassRx,,,,OTH,0,N,0,65862019201,FLUoxetine HCl Oral Capsule 10 MG,10MG,,5.816E+13,FLUOXETINE HCL CAP 10 MG,5/3/2022,30,,1129940,7,C,KROGER DRUGSTORE #291,6199 HIGHWAY 92,ACWORTH,GA,30102,N,MAC,4.81,0.03365,3.76474
CerpassRx,,,,OTH,0,N,0,13668000805,Zolpidem Tartrate Oral Tablet 10 MG,10MG,,6.02041E+13,ZOLPIDEM TARTRATE TAB 10 MG,5/3/2022,30,,1175175,7,C,MILLER PHARMACY,213 DELORES STREET,COLQUITT,GA,39837,N,MAC,5,0.0301,4.5371
CerpassRx,,,,OTH,6,N,0,53489015710,Allopurinol Oral Tablet 300 MG,300MG,,6.8E+13,ALLOPURINOL TAB 300 MG,5/3/2022,30,,1115939,7,C,SUMNER PHARMACY,8691 N. MARCUS ST.,WRIGHTSVILLE,GA,31096,N,MAC,4.72,0.08312,0.89285
CerpassRx,,,,OTH,2,N,0,69315012710,Folic Acid Oral Tablet 1 MG,1MG,,8.22E+13,FOLIC ACID TAB 1 MG,5/3/2022,30,,1141477,7,C,CVS PHARMACY #07615,300 MORGAN ST,LA GRANGE,GA,30241,N,AWP,0.4,0.02568,-0.48079
CerpassRx,,,,OTH,0,N,0,59417010710,Vyvanse Oral Capsule 70 MG,70MG,,6.11E+13,LISDEXAMFETAMINE DIMESYLATE CAP 70 MG,5/4/2022,30,,1157381,7,C,WINN DIXIE PHARMACY,220 RETREAT VILLAGE,ST SIMONS ISLAND,GA,31522,N,AWP,338.72,11.24648,0.00393
CerpassRx,,,,OTH,0,N,0,378416201,Atovaquone-Proguanil HCl Oral Tablet 250-100 MG,250-100MG,,1.399E+13,ATOVAQUONE-PROGUANIL HCL TAB 250-100 MG,5/4/2022,23,,1145449,7,C,CVS PHARMACY #03013,3905 DUE WEST NW RD,MARIETTA,GA,30064,N,AWP,26.84,2.47536,-0.52857
CerpassRx,,,,OTH,0,N,0,68180013501,Escitalopram Oxalate Oral Tablet 10 MG,10MG,,5.816E+13,ESCITALOPRAM OXALATE TAB 10 MG (BASE EQUIV),5/4/2022,30,,1158888,7,C,WALGREENS #2454,3116 HIGHWAY 34 E,NEWNAN,GA,302651342,N,AWP,28.08,0.04972,17.82542
CerpassRx,,,,OTH,1,N,0,16729032010,Olmesartan Medoxomil Oral Tablet 5 MG,5MG,,3.61501E+13,OLMESARTAN MEDOXOMIL TAB 5 MG,5/4/2022,30,,1152545,7,C,WALMART PHARMACY 10-5422,500 EAST ALICE STREET,BAINBRIDGE,GA,39819,N,AWP,10.11,0.07425,3.53872
CerpassRx,,,,OTH,0,N,0,75826011510,Phenazopyridine HCl Oral Tablet 200 MG,200MG,,5.63E+13,PHENAZOPYRIDINE HCL TAB 200 MG,5/4/2022,30,,1117096,7,C,CVS PHARMACY #04565,960 N COLUMBIA ST,MILLEDGEVILLE,GA,31061,N,AWP,18.36,0.54434,0.1243
CerpassRx,,,,OTH,0,N,0,21922000404,Desonide External Ointment 0.05 %,0.05%,,9.055E+13,DESONIDE OINT 0.05%,5/4/2022,15,,1176292,7,C,COLQUITT PHARMACY INC,215 W MAIN ST,COLQUITT,GA,398373407,N,MAC,9.86,0.83836,-0.21593
CerpassRx,,,,OTH,1,N,0,16729017117,Amitriptyline HCl Oral Tablet 10 MG,10MG,,5.82E+13,AMITRIPTYLINE HCL TAB 10 MG,5/4/2022,30,,1150212,7,C,PUBLIX PHARMACY #0853,6320 LAKE OCONEE PARKWAY,GREENSBORO,GA,30642,N,MAC,3.79,0.04811,1.62593
CerpassRx,,,,OTH,2,N,0,16714062101,Zolpidem Tartrate Oral Tablet 5 MG,5MG,,6.02041E+13,ZOLPIDEM TARTRATE TAB 5 MG,5/4/2022,30,,1126134,7,C,QUICK RX DRUGS,504 N LAUREL ST,SPRINGFIELD,GA,31329,N,MAC,4.79,0.03056,4.22469
CerpassRx,,,,OTH,1,N,0,29300022019,Montelukast Sodium Oral Tablet 10 MG,10MG,,4.45051E+13,MONTELUKAST SODIUM TAB 10 MG (BASE EQUIV),5/4/2022,30,,1131856,7,C,WALMART PHARMACY 10-1111,1572 ANDERSON HWY,HARTWELL,GA,30643,N,AWP,10.18,0.06589,4.15
CerpassRx,,,,OTH,0,N,0,68645051954,Escitalopram Oxalate Oral Tablet 10 MG,10MG,,5.816E+13,ESCITALOPRAM OXALATE TAB 10 MG (BASE EQUIV),5/4/2022,30,,1131856,7,C,WALMART PHARMACY 10-1111,1572 ANDERSON HWY,HARTWELL,GA,30643,N,AWP,8.49,0.04972,4.69187
CerpassRx,,,,OTH,0,N,0,65862058701,amLODIPine Besy-Benazepril HCl Oral Capsule 10-40 ,10-40MG,,3.69915E+13,AMLODIPINE BESYLATE-BENAZEPRIL HCL CAP 10-40 MG,5/4/2022,30,,1131856,7,C,WALMART PHARMACY 10-1111,1572 ANDERSON HWY,HARTWELL,GA,30643,N,AWP,8.81,0.17354,0.69221
CerpassRx,,,,OTH,0,N,0,54838050280,hydrOXYzine HCl Oral Syrup 10 MG/5ML,10MG/5ML,,5.72E+13,HYDROXYZINE HCL SYRUP 10 MG/5ML,5/4/2022,120,,1115206,7,C,THE MEDICINE SHOPPE,2921 N ASHLEY STREET,VALDOSTA,GA,31602,N,MAC,11.64,0.06612,0.46703
CerpassRx,,,,OTH,0,N,0,406183001,Methylphenidate HCl ER (CD) Oral Capsule Extended ,30MG,,6.14E+13,METHYLPHENIDATE HCL CAP ER 30 MG (CD),5/4/2022,30,,1156288,7,C,WALGREENS #10423,3290 KEITH BRIDGE RD,CUMMING,GA,300413937,N,AWP,50.13,1.42159,0.17544
CerpassRx,,,,OTH,0,N,0,65162027250,Sulfamethoxazole-Trimethoprim Oral Tablet 800-160 ,800-160MG,,1.699E+13,SULFAMETHOXAZOLE-TRIMETHOPRIM TAB 800-160 MG,5/4/2022,20,,1109405,7,C,MAX BROWN PHARMACY,809 N JEFFERSON ST,DUBLIN,GA,31021,N,MAC,1.22,0.06566,-0.07097
CerpassRx,,,,OTH,0,N,0,51224002218,Azithromycin Oral Tablet 250 MG,250MG,,3.40001E+12,AZITHROMYCIN TAB 250 MG,5/4/2022,6,,1137757,7,C,WINN DIXIE,1060 LAKES BLVD,LAKE PARK,GA,31636,N,MAC,6.58,0.48506,1.26089
CerpassRx,,,,OTH,1,N,0,64380093308,Losartan Potassium Oral Tablet 25 MG,25MG,,3.615E+13,LOSARTAN POTASSIUM TAB 25 MG,5/5/2022,30,,1139674,7,C,PUBLIX PHARMACY #0451,3620 ATLANTA HWY,ATHENS,GA,30606,N,MAC,3.61,0.0613,0.96302
CerpassRx,,,,OTH,1,N,0,72205000499,Rosuvastatin Calcium Oral Tablet 20 MG,20MG,,3.94001E+13,ROSUVASTATIN CALCIUM TAB 20 MG,5/5/2022,30,,1139674,7,C,PUBLIX PHARMACY #0451,3620 ATLANTA HWY,ATHENS,GA,30606,N,MAC,2.44,0.07822,0.0398
CerpassRx,,,,OTH,1,N,0,47781065710,Levothyroxine Sodium Oral Tablet 125 MCG,125MCG,,2.81E+13,LEVOTHYROXINE SODIUM TAB 125 MCG,5/5/2022,30,,1139674,7,C,PUBLIX PHARMACY #0451,3620 ATLANTA HWY,ATHENS,GA,30606,N,MAC,7.05,0.18894,0.24378
CerpassRx,,,,OTH,2,N,0,70700012185,Tri-Estarylla Oral Tablet 0.18/0.215/0.25 MG-35 MC,0.18/0.215/0.25MG-35 MCG,,2.5992E+13,NORGESTIMATE-ETH ESTRAD TAB 0.18-35/0.215-35/0.25-35 MG-MCG,5/5/2022,28,,1159929,7,C,CVS PHARMACY #08960,5101 WASHINGTON RD,EVANS,GA,308096445,N,AWP,6.68,0.1602,0.48921
CerpassRx,,,,OTH,7,N,0,53746054501,Primidone Oral Tablet 250 MG,250MG,,7.26001E+13,PRIMIDONE TAB 250 MG,5/5/2022,30,,1162712,7,C,AU MEDICAL CENTER EMPLOYEE PHARMACY,1481 LANEY WALKER BLVD,AUGUSTA,GA,309120004,N,MAC,12.63,0.31086,0.35431
CerpassRx,,,,OTH,0,N,0,42806071401,Benzonatate Oral Capsule 100 MG,100MG,,4.3102E+13,BENZONATATE CAP 100 MG,5/5/2022,30,,1167623,7,C,WALMART PHARMACY 10-4421,7400 BLACKMON RD,COLUMBUS,GA,319094480,N,AWP,4.51,0.09389,0.60116
CerpassRx,,,,OTH,1,N,0,31722000290,Venlafaxine HCl ER Oral Capsule Extended Release 2,37.5MG,,5.81801E+13,VENLAFAXINE HCL CAP ER 24HR 37.5 MG (BASE EQUIVALENT),5/5/2022,30,,1131589,7,C,WALMART PHARMACY 10-1112,855 NORTH CHURCH ST.,THOMASTON,GA,30286,N,AWP,7.5,0.11725,1.1322
CerpassRx,,,,OTH,2,N,0,72305010030,Euthyrox Oral Tablet 100 MCG,100MCG,,2.81E+13,LEVOTHYROXINE SODIUM TAB 100 MCG,5/5/2022,30,,1167623,7,C,WALMART PHARMACY 10-4421,7400 BLACKMON RD,COLUMBUS,GA,319094480,N,AWP,1.01,,
CerpassRx,,,,OTH,0,N,0,42806031250,Doxycycline Hyclate Oral Tablet 100 MG,100MG,,4.00002E+12,DOXYCYCLINE HYCLATE TAB 100 MG,5/5/2022,14,,1167623,7,C,WALMART PHARMACY 10-4421,7400 BLACKMON RD,COLUMBUS,GA,319094480,N,AWP,5.16,0.14445,1.55155
CerpassRx,,,,OTH,0,N,0,185209901,Amphetamine-Dextroamphetamine Oral Tablet 30 MG,30MG,,6.11099E+13,AMPHETAMINE-DEXTROAMPHETAMINE TAB 30 MG,5/5/2022,60,,1158408,7,C,CVS PHARMACY #05418,1905 MARTHA BERRY BLVD,ROME,GA,301651649,N,AWP,17.48,,
CerpassRx,,,,OTH,12,N,0,16714040604,Larin Fe 1/20 Oral Tablet 1-20 MG-MCG,1-20MG-MCG,,2.599E+13,NORETHINDRONE ACE & ETHINYL ESTRADIOL-FE TAB 1 MG-20 MCG,5/5/2022,28,,1152533,7,C,WALMART PHARMACY 10-5392,980 WEST PARKER STREET,BAXLEY,GA,31513,N,AWP,1.72,0.20374,-0.6985
CerpassRx,,,,OTH,0,N,0,57237000511,Fluconazole Oral Tablet 150 MG,150MG,,1.1407E+13,FLUCONAZOLE TAB 150 MG,5/5/2022,2,,1156682,7,C,WALGREENS #10632,1602 N EXPRESSWAY,GRIFFIN,GA,302231269,N,AWP,5.53,0.74933,2.68996
CerpassRx,,,,OTH,3,N,0,68645055354,Lisinopril Oral Tablet 20 MG,20MG,,3.61E+13,LISINOPRIL TAB 20 MG,5/5/2022,30,,1151618,7,C,WALMART PHARMACY 10-2890,5955 ZEBULON ROAD,MACON (N),GA,31201,N,AWP,1.92,0.02633,1.43069
CerpassRx,,,,OTH,3,N,0,6536403,Steglatro Oral Tablet 15 MG,15MG,,2.77001E+13,ERTUGLIFLOZIN L-PYROGLUTAMIC ACID TAB 15 MG (BASE EQUIV),5/5/2022,30,,1151618,7,C,WALMART PHARMACY 10-2890,5955 ZEBULON ROAD,MACON (N),GA,31201,N,AWP,313.56,10.39813,0.00518
CerpassRx,,,,OTH,4,N,0,42806054701,Vitamin D (Ergocalciferol) Oral Capsule 1.25 MG (5,1.25 MG(50000 UT),,7.7202E+13,ERGOCALCIFEROL CAP 1.25 MG (50000 UNIT),5/5/2022,4,,1151618,7,C,WALMART PHARMACY 10-2890,5955 ZEBULON ROAD,MACON (N),GA,31201,N,AWP,0.47,0.14082,-0.1656
CerpassRx,,,,OTH,1,N,0,13668044201,Celecoxib Oral Capsule 200 MG,200MG,,6.61005E+13,CELECOXIB CAP 200 MG,5/5/2022,30,,1171696,7,C,WALGREENS #17548,100 WEST 3RD STREET,DONALSONVILLE,GA,398451506,N,AWP,45.08,0.13496,10.13416
CerpassRx,,,,OTH,1,N,0,43547035411,Lisinopril Oral Tablet 20 MG,20MG,,3.61E+13,LISINOPRIL TAB 20 MG,5/5/2022,30,,1171696,7,C,WALGREENS #17548,100 WEST 3RD STREET,DONALSONVILLE,GA,398451506,N,AWP,6.31,0.02633,6.98835
CerpassRx,,,,OTH,0,N,0,59746033790,Losartan Potassium-HCTZ Oral Tablet 50-12.5 MG,50-12.5MG,,3.6994E+13,LOSARTAN POTASSIUM & HYDROCHLOROTHIAZIDE TAB 50-12.5 MG,5/5/2022,30,,1165275,7,C,WALMART PHARMACY 10-7246,366 HWY 26 E,COCHRAN,GA,310146049,N,U&C,4,0.18477,-0.27838
CerpassRx,,,,OTH,0,N,0,68462043730,Olmesartan Medoxomil Oral Tablet 20 MG,20MG,,3.61501E+13,OLMESARTAN MEDOXOMIL TAB 20 MG,5/5/2022,30,,1148003,7,C,WALGREENS #6330,2464 ROSWELL RD,MARIETTA,GA,300624954,N,AWP,41.16,0.1002,12.69261
CerpassRx,,,,OTH,0,N,0,60505082601,Ipratropium Bromide Nasal Solution 0.03 %,0.03%,,4.23E+13,IPRATROPIUM BROMIDE NASAL SOLN 0.03% (21 MCG/SPRAY),5/5/2022,30,,1145312,7,C,WALMART PHARMACY 10-2615,3274 INNER PERIMETER ROAD,VALDOSTA,GA,31602,N,AWP,6.7,0.75257,-0.70324