﻿ContractedPBMName,ContractedPBMLicenseID,ServicingPBMName,CompoundInd,IngredientNo,NDCNo,DrugName,DrugStrength,DrugStrengthMetricUnit,GPICode,GPIDesc,DrugFillDate,QtyFilled,QtyFillUnit,ProviderIdNo,ProviderIdQual,PTypeCode,PName,PAddress,PCity,PState,PZip,PharmAffil,PricingMeth,IngredientCost,AvgNADACCost,ReimbPercentNADAC,DaysSupply,Brand/Generic
CerpassRx,,,N,0,70377000712,Rosuvastatin Calcium Oral Tablet 10 MG,10MG,,3.94E+13,ROSUVASTATIN CALCIUM TAB 10 MG,5/1/2023,30,,1146718,7,C,CVS PHARMACY #02504,2586 LAWRENCEVILLE HWY,DECATUR,GA,30033,N,AWP,26.8,0.04839,17.46111,30,G
CerpassRx,,,N,0,68001051903,buPROPion HCl ER (XL) Oral Tablet Extended Release,150MG,,5.83E+13,BUPROPION HCL TAB ER 24HR 150 MG,5/1/2023,30,,1174111,7,C,ADAMS FAMILY PHARMACY,98 PEACHTREE ST,CUTHBERT,GA,398405807,N,MAC,9.08,,,30,G
CerpassRx,,,N,0,69238183801,Levothyroxine Sodium Oral Tablet 150 MCG,150MCG,,2.81E+13,LEVOTHYROXINE SODIUM TAB 150 MCG,5/1/2023,30,,1156682,7,C,WALGREENS #10632,1602 N EXPRESSWAY,GRIFFIN,GA,302231269,N,AWP,4.04,0.13027,0.03375,30,G
CerpassRx,,,N,0,42794001812,Liothyronine Sodium Oral Tablet 5 MCG,5MCG,,2.81E+13,LIOTHYRONINE SODIUM TAB 5 MCG,5/1/2023,30,,1156682,7,C,WALGREENS #10632,1602 N EXPRESSWAY,GRIFFIN,GA,302231269,N,AWP,5.06,0.32056,-0.47384,30,G
CerpassRx,,,N,0,59417010510,Vyvanse Oral Capsule 50 MG,50MG,,6.11E+13,LISDEXAMFETAMINE DIMESYLATE CAP 50 MG,5/1/2023,30,,1156923,7,C,WALMART PHARMACY 10-4200,6475 GATEWAY RD,COLUMBUS,GA,31909,N,AWP,356.76,11.25475,0.05662,30,B
CerpassRx,,,N,0,59417010510,Vyvanse Oral Capsule 50 MG,50MG,,6.11E+13,LISDEXAMFETAMINE DIMESYLATE CAP 50 MG,5/1/2023,30,,1156923,7,C,WALMART PHARMACY 10-4200,6475 GATEWAY RD,COLUMBUS,GA,31909,N,AWP,356.76,11.81748,0.00631,30,B
CerpassRx,,,N,0,65862030901,Fosinopril Sodium-HCTZ Oral Tablet 20-12.5 MG,20-12.5MG,,3.70E+13,FOSINOPRIL SODIUM & HYDROCHLOROTHIAZIDE TAB 20-12.5 MG,5/1/2023,60,,1151341,7,C,KROGER DRUGSTORE #667,1476 TURNER MCCALL BLVD,ROME,GA,30161,N,MAC,49.79,,,30,G
CerpassRx,,,N,0,29300041001,Atenolol Oral Tablet 25 MG,25MG,,3.32E+13,ATENOLOL TAB 25 MG,5/1/2023,45,,1164716,7,C,WALMART PHARMACY 10-7245,1102 E FRANKLIN ST,SYLVESTER,GA,317917186,N,AWP,2.21,,,90,G
CerpassRx,,,N,0,69680013393,Potassium Chloride ER Oral Tablet Extended Release,10MEQ,,7.97E+13,POTASSIUM CHLORIDE TAB ER 10 MEQ,5/1/2023,90,,1164716,7,C,WALMART PHARMACY 10-7245,1102 E FRANKLIN ST,SYLVESTER,GA,317917186,N,AWP,1.29,0.13033,-0.89002,90,G
CerpassRx,,,N,0,61755002002,Praluent Subcutaneous Solution Auto-injector 75 MG,75MG/ML,,3935001000D520,ALIROCUMAB SUBCUTANEOUS SOLUTION AUTO-INJECTOR 75 MG/ML,5/1/2023,2,,1163459,7,C,UNADILLA DRUG COMPANY,413 SECOND ST,UNADILLA,GA,31091,N,AWP,498.03,238.03985,0.04611,28,B
CerpassRx,,,N,0,61755002002,Praluent Subcutaneous Solution Auto-injector 75 MG,75MG/ML,,3935001000D520,ALIROCUMAB SUBCUTANEOUS SOLUTION AUTO-INJECTOR 75 MG/ML,5/1/2023,2,,1163459,7,C,UNADILLA DRUG COMPANY,413 SECOND ST,UNADILLA,GA,31091,N,AWP,498.03,238.03985,0.04611,28,B
CerpassRx,,,N,0,68462073129,Hailey 24 Fe Oral Tablet 1-20 MG-MCG(24),1-20MG-MCG(24),,2.60E+13,NORETHINDRONE ACE-ETHINYL ESTRADIOL-FE TAB 1 MG-20 MCG (24),5/1/2023,28,,1149459,7,C,CVS PHARMACY #16733,1525 MARKET PLACE BLVD,CUMMING,GA,30041,N,AWP,67.85,0.35053,5.913,28,G
CerpassRx,,,N,0,310737220,Budesonide-Formoterol Fumarate Inhalation Aerosol ,80-4.5MCG/ACT,,4.42E+13,BUDESONIDE-FORMOTEROL FUMARATE DIHYD AEROSOL 80-4.5 MCG/ACT,5/1/2023,10.2,,1156682,7,C,WALGREENS #10632,1602 N EXPRESSWAY,GRIFFIN,GA,302231269,N,AWP,69.98,19.89945,-0.65523,30,B
CerpassRx,,,N,0,72495040128,Intrarosa Vaginal Insert 6.5 MG,6.5MG,,5.54E+13,PRASTERONE VAGINAL INSERT 6.5 MG,5/1/2023,28,,1112779,7,C,OCILLA PHARMACY,515 NORTH IRWIN AVENUE,OCILLA,GA,31774,N,AWP,244.95,8.73788,0.00118,28,B
CerpassRx,,,N,0,72495040128,Intrarosa Vaginal Insert 6.5 MG,6.5MG,,5.54E+13,PRASTERONE VAGINAL INSERT 6.5 MG,5/1/2023,28,,1112779,7,C,OCILLA PHARMACY,515 NORTH IRWIN AVENUE,OCILLA,GA,31774,N,AWP,244.95,8.73788,0.00118,28,B
CerpassRx,,,N,0,45802090094,Clindamycin Phosphate External Gel 1 %,1%,,9.01E+13,CLINDAMYCIN PHOSPHATE GEL 1%,5/1/2023,30,,1161556,7,C,HODGSON'S PHARMACY,1260 S MILLEDGE AVE,ATHENS,GA,30605,N,AWP,16.32,,,30,G
CerpassRx,,,N,0,472011720,Tretinoin External Cream 0.025 %,0.03%,,9.01E+13,TRETINOIN CREAM 0.025%,5/1/2023,20,,1161556,7,C,HODGSON'S PHARMACY,1260 S MILLEDGE AVE,ATHENS,GA,30605,N,MAC,28.85,1.57771,-0.0857,20,G
CerpassRx,,,N,0,2147180,Mounjaro Subcutaneous Solution Pen-injector 10 MG/,10MG/0.5ML,,2717308000D225,TIRZEPATIDE SOLN PEN-INJECTOR 10 MG/0.5ML,5/1/2023,2,,1106586,7,C,BAINBRIDGE PHARMACY INC,1420 EVANS ST,BAINBRIDGE,GA,39819,N,AWP,1000.54,,,28,B
CerpassRx,,,N,0,29033000305,Sucralfate Oral Tablet 1 GM,1GM,,4.93E+13,SUCRALFATE TAB 1 GM,5/1/2023,60,,1170884,7,C,WALGREENS #19997,4242 NORTH SECOND STREET,FOLKSTON,GA,315373008,N,AWP,8.43,0.21237,-0.33842,30,G
CerpassRx,,,N,0,69238110005,Doxycycline Hyclate Oral Capsule 100 MG,100MG,,4.00E+12,DOXYCYCLINE HYCLATE CAP 100 MG,5/1/2023,30,,1161556,7,C,HODGSON'S PHARMACY,1260 S MILLEDGE AVE,ATHENS,GA,30605,N,MAC,4.06,0.13375,0.01184,30,G
CerpassRx,,,N,0,60505257808,Atorvastatin Calcium Oral Tablet 10 MG,10MG,,3.94E+13,ATORVASTATIN CALCIUM TAB 10 MG (BASE EQUIVALENT),5/1/2023,30,,1170884,7,C,WALGREENS #19997,4242 NORTH SECOND STREET,FOLKSTON,GA,315373008,N,AWP,24.1,0.03206,24.05718,30,G
CerpassRx,,,N,0,69584009150,busPIRone HCl Oral Tablet 5 MG,5MG,,5.72E+13,BUSPIRONE HCL TAB 5 MG,5/1/2023,60,,1136058,7,C,CVS PHARMACY #04723,439 HIGHLAND AVE NE,ATLANTA,GA,30312,N,AWP,4.4,0.02731,1.68522,30,G
CerpassRx,,,N,0,13668013701,Escitalopram Oxalate Oral Tablet 20 MG,20MG,,5.82E+13,ESCITALOPRAM OXALATE TAB 20 MG (BASE EQUIV),5/1/2023,30,,1136058,7,C,CVS PHARMACY #04723,439 HIGHLAND AVE NE,ATLANTA,GA,30312,N,AWP,13.54,0.087,4.18774,30,G
CerpassRx,,,N,0,49483070210,FLUoxetine HCl Oral Capsule 20 MG,20MG,,5.82E+13,FLUOXETINE HCL CAP 20 MG,5/2/2023,30,,1149055,7,C,PUBLIX PHARMACY #0783,2235 GLENWOOD AVE,ATLANTA,GA,30316,N,AWP,1.37,,,30,G
CerpassRx,,,N,0,68462039710,Omeprazole Oral Capsule Delayed Release 40 MG,40MG,,4.93E+13,OMEPRAZOLE CAP DELAYED RELEASE 40 MG,5/2/2023,30,,1171696,7,C,WALGREENS #17548,100 WEST 3RD STREET,DONALSONVILLE,GA,398451506,N,AWP,44.04,0.05992,23.49933,30,G
CerpassRx,,,N,0,53746051101,Spironolactone Oral Tablet 25 MG,25MG,,3.75E+13,SPIRONOLACTONE TAB 25 MG,5/2/2023,30,,1144409,7,C,CVS PHARMACY #02236,1600 TOWNE LAKE PKWY,WOODSTOCK,GA,30189,N,AWP,4.29,0.0542,1.63838,30,G
CerpassRx,,,N,0,65862007930,Terbinafine HCl Oral Tablet 250 MG,250MG,,1.10E+13,TERBINAFINE HCL TAB 250 MG,5/2/2023,12,,1156288,7,C,WALGREENS #10423,3290 KEITH BRIDGE RD,CUMMING,GA,300413937,N,U&C,31.59,0.1593,15.52542,12,G
CerpassRx,,,N,0,68180035103,Sertraline HCl Oral Tablet 25 MG,25MG,,5.82E+13,SERTRALINE HCL TAB 25 MG,5/2/2023,30,,1156288,7,C,WALGREENS #10423,3290 KEITH BRIDGE RD,CUMMING,GA,300413937,N,AWP,16.98,0.03823,13.80513,30,G
CerpassRx,,,N,0,68180035103,Sertraline HCl Oral Tablet 25 MG,25MG,,5.82E+13,SERTRALINE HCL TAB 25 MG,5/2/2023,30,,1156288,7,C,WALGREENS #10423,3290 KEITH BRIDGE RD,CUMMING,GA,300413937,N,AWP,16.98,0.05057,10.19241,30,G
CerpassRx,,,N,0,31722070530,valACYclovir HCl Oral Tablet 1 GM,1GM,,1.24E+13,VALACYCLOVIR HCL TAB 1 GM,5/2/2023,30,,1136058,7,C,CVS PHARMACY #04723,439 HIGHLAND AVE NE,ATLANTA,GA,30312,N,AWP,43.92,0.50118,1.92111,30,G
CerpassRx,,,N,0,43386035701,HYDROcodone-Acetaminophen Oral Tablet 7.5-325 MG,7.5-325MG,,6.60E+13,HYDROCODONE-ACETAMINOPHEN TAB 7.5-325 MG,5/2/2023,60,,1171646,7,C,WALGREENS #17278,211 TEMPLE AVENUE,NEWNAN,GA,302631328,N,AWP,9.17,0.13148,0.16241,30,G
CerpassRx,,,N,0,67877019805,amLODIPine Besylate Oral Tablet 5 MG,5MG,,3.40E+13,AMLODIPINE BESYLATE TAB 5 MG (BASE EQUIVALENT),5/2/2023,30,,1132430,7,C,WALMART PHARMACY 10-1143,1308 S. HARRIS ST.,SANDERSVILLE,GA,310826913,N,AWP,3.22,0.01007,9.65872,30,G
CerpassRx,,,N,0,406012505,HYDROcodone-Acetaminophen Oral Tablet 10-325 MG,10-325MG,,6.60E+13,HYDROCODONE-ACETAMINOPHEN TAB 10-325 MG,5/2/2023,120,,1163550,7,C,WALGREENS #15180,101 N TENNESSEE ST,CARTERSVILLE,GA,301203211,N,AWP,23.3,0.12193,0.59244,30,G
CerpassRx,,,N,0,70377002911,Atorvastatin Calcium Oral Tablet 40 MG,40MG,,3.94E+13,ATORVASTATIN CALCIUM TAB 40 MG (BASE EQUIVALENT),5/2/2023,30,,1144409,7,C,CVS PHARMACY #02236,1600 TOWNE LAKE PKWY,WOODSTOCK,GA,30189,N,AWP,17.32,0.06902,7.36473,30,G
CerpassRx,,,N,0,68001050103,Metoprolol Succinate ER Oral Tablet Extended Relea,50MG,,3.32E+13,METOPROLOL SUCCINATE TAB ER 24HR 50 MG (TARTRATE EQUIV),5/2/2023,30,,1122352,7,C,HOGAN'S PHARMACY,2704 NORTH OAK ST,VALDOSTA,GA,31602,N,MAC,3.59,,,30,G
CerpassRx,,,N,0,43547033803,Benazepril HCl Oral Tablet 40 MG,40MG,,3.61E+13,BENAZEPRIL HCL TAB 40 MG,5/2/2023,90,,1164716,7,C,WALMART PHARMACY 10-7245,1102 E FRANKLIN ST,SYLVESTER,GA,317917186,N,AWP,5.67,0.09417,-0.331,90,G
CerpassRx,,,N,0,65862067799,ALPRAZolam Oral Tablet 0.5 MG,0.5MG,,5.71E+13,ALPRAZOLAM TAB 0.5 MG,5/2/2023,60,,1160706,7,C,PUBLIX PHARMACY #1291,6015 WATSON BLVD.,BYRON,GA,31008,N,MAC,1.87,0.02103,0.48201,30,G
CerpassRx,,,N,0,13668000805,Zolpidem Tartrate Oral Tablet 10 MG,10MG,,6.02E+13,ZOLPIDEM TARTRATE TAB 10 MG,5/3/2023,30,,1137884,7,C,CVS PHARMACY #05520,5401 ABERCORN ST,SAVANNAH,GA,314056901,N,AWP,13.88,0.03542,12.0623,30,G
CerpassRx,,,N,0,62332025130,Azithromycin Oral Tablet 250 MG,250MG,,3.40E+12,AZITHROMYCIN TAB 250 MG,5/3/2023,6,,1145893,7,C,KROGER DRUGSTORE #459,2875 NORTH DECATUR ROAD,DECATUR,GA,30033,N,MAC,4.17,0.32992,1.10657,5,G
CerpassRx,,,N,0,597015390,Jardiance Oral Tablet 25 MG,25MG,,2.77E+13,EMPAGLIFLOZIN TAB 25 MG,5/3/2023,30,,1163459,7,C,UNADILLA DRUG COMPANY,413 SECOND ST,UNADILLA,GA,31091,N,AWP,600.89,18.23551,0.09839,30,B
CerpassRx,,,N,0,597015390,Jardiance Oral Tablet 25 MG,25MG,,2.77E+13,EMPAGLIFLOZIN TAB 25 MG,5/3/2023,30,,1163459,7,C,UNADILLA DRUG COMPANY,413 SECOND ST,UNADILLA,GA,31091,N,AWP,600.89,18.96493,0.05614,30,B
CerpassRx,,,N,0,65862052890,Venlafaxine HCl ER Oral Capsule Extended Release 2,75MG,,5.82E+13,VENLAFAXINE HCL CAP ER 24HR 75 MG (BASE EQUIVALENT),5/3/2023,30,,1160706,7,C,PUBLIX PHARMACY #1291,6015 WATSON BLVD.,BYRON,GA,31008,N,MAC,4.77,0.10601,0.49986,10,G
CerpassRx,,,N,0,16714062202,Zolpidem Tartrate Oral Tablet 10 MG,10MG,,6.02E+13,ZOLPIDEM TARTRATE TAB 10 MG,5/3/2023,15,,1160706,7,C,PUBLIX PHARMACY #1291,6015 WATSON BLVD.,BYRON,GA,31008,N,MAC,1.55,0.03542,1.91737,15,G
CerpassRx,,,N,0,54017713,Buprenorphine HCl Sublingual Tablet Sublingual 8 M,8MG,,6.52E+13,BUPRENORPHINE HCL SL TAB 8 MG (BASE EQUIV),5/3/2023,90,,1117185,7,C,THOMAS DRUGS,2704 JEFFERSON ST,AUSTELL,GA,30168,N,MAC,80.47,0.80112,0.11608,30,G
CerpassRx,,,N,0,378395105,Atorvastatin Calcium Oral Tablet 20 MG,20MG,,3.94E+13,ATORVASTATIN CALCIUM TAB 20 MG (BASE EQUIVALENT),5/4/2023,30,,1170884,7,C,WALGREENS #19997,4242 NORTH SECOND STREET,FOLKSTON,GA,315373008,N,AWP,34.34,0.04635,23.69615,30,G
CerpassRx,,,N,0,69097015915,Meloxicam Oral Tablet 15 MG,15MG,,6.61E+13,MELOXICAM TAB 15 MG,5/4/2023,30,,1170884,7,C,WALGREENS #19997,4242 NORTH SECOND STREET,FOLKSTON,GA,315373008,N,AWP,28.85,0.02319,40.46902,30,G
CerpassRx,,,N,0,43547036211,Losartan Potassium Oral Tablet 100 MG,100MG,,3.62E+13,LOSARTAN POTASSIUM TAB 100 MG,5/4/2023,30,,1170884,7,C,WALGREENS #19997,4242 NORTH SECOND STREET,FOLKSTON,GA,315373008,N,AWP,18.46,0.07007,7.78169,30,G
CerpassRx,,,N,0,29300035005,Allopurinol Oral Tablet 300 MG,300MG,,6.80E+13,ALLOPURINOL TAB 300 MG,5/4/2023,30,,1170884,7,C,WALGREENS #19997,4242 NORTH SECOND STREET,FOLKSTON,GA,315373008,N,AWP,5.22,0.08279,1.1017,30,G
CerpassRx,,,N,0,13668000810,Zolpidem Tartrate Oral Tablet 10 MG,10MG,,6.02E+13,ZOLPIDEM TARTRATE TAB 10 MG,5/4/2023,30,,1175632,7,C,BAXLEY WELLNESS PHARMACY INC,160 AZALEA RD,BAXLEY,GA,31513,N,MAC,3.1,0.03542,1.91737,30,G
CerpassRx,,,N,0,555097402,Amphetamine-Dextroamphetamine Oral Tablet 30 MG,30MG,,6.11E+13,AMPHETAMINE-DEXTROAMPHETAMINE TAB 30 MG,5/4/2023,60,,1150363,7,C,WALKER PHARMACY MARKET DISTRICT,1198 MERCHANTS WAY,STATESBORO,GA,30458,N,MAC,22.3,0.31992,0.16175,30,G
CerpassRx,,,N,0,68180013601,Escitalopram Oxalate Oral Tablet 20 MG,20MG,,5.82E+13,ESCITALOPRAM OXALATE TAB 20 MG (BASE EQUIV),5/4/2023,30,,1151985,7,C,WALGREENS #2455,2580 SANDY PLAINS RD,MARIETTA,GA,300665798,N,AWP,29.3,0.087,10.22605,30,G
CerpassRx,,,N,0,69097015907,Meloxicam Oral Tablet 15 MG,15MG,,6.61E+13,MELOXICAM TAB 15 MG,5/4/2023,14,,1157571,7,C,CVS PHARMACY #03882,450 PEACHTREE PKWY,CUMMING,GA,300416818,N,AWP,6.78,0.02319,19.88339,14,G
CerpassRx,,,N,0,68180096301,Albuterol Sulfate HFA Inhalation Aerosol Solution ,108 (90 Base)MCG/ACT,,4.42E+13,ALBUTEROL SULFATE INHAL AERO 108 MCG/ACT (90MCG BASE EQUIV),5/4/2023,8.5,,1131589,7,C,WALMART PHARMACY 10-1112,855 NORTH CHURCH ST.,THOMASTON,GA,30286,N,AWP,4.44,,,17,G
CerpassRx,,,N,0,574403105,Tobramycin-Dexamethasone Ophthalmic Suspension 0.3,0.3-0.1%,,8.63E+13,TOBRAMYCIN-DEXAMETHASONE OPHTH SUSP 0.3-0.1%,5/4/2023,5,,1169413,7,C,PUBLIX PHARMACY #1226,2275 MARIETTA BLVD NW,ATLANTA,GA,303182019,N,AWP,59.32,,,12,G
CerpassRx,,,N,0,406012310,HYDROcodone-Acetaminophen Oral Tablet 5-325 MG,5-325MG,,6.60E+13,HYDROCODONE-ACETAMINOPHEN TAB 5-325 MG,5/4/2023,24,,1110612,7,C,CHANCY DRUGS HAHIRA,205 E MAIN ST,HAHIRA,GA,316321193,N,MAC,2.17,0.10775,-0.16087,4,G
CerpassRx,,,N,0,69315090510,LORazepam Oral Tablet 1 MG,1MG,,5.71E+13,LORAZEPAM TAB 1 MG,5/4/2023,2,,1110612,7,C,CHANCY DRUGS HAHIRA,205 E MAIN ST,HAHIRA,GA,316321193,N,MAC,0.17,0.03994,1.12819,1,G
CerpassRx,,,N,0,904585440,Ibuprofen Oral Tablet 600 MG,600MG,,6.61E+13,IBUPROFEN TAB 600 MG,5/4/2023,16,,1110612,7,C,CHANCY DRUGS HAHIRA,205 E MAIN ST,HAHIRA,GA,316321193,N,MAC,1.73,0.05423,0.99382,4,G
CerpassRx,,,N,0,16714001402,Amoxicillin-Pot Clavulanate Oral Tablet 875-125 MG,875-125MG,,1.99E+12,AMOXICILLIN & K CLAVULANATE TAB 875-125 MG,5/4/2023,20,,1110612,7,C,CHANCY DRUGS HAHIRA,205 E MAIN ST,HAHIRA,GA,316321193,N,MAC,8.72,,,10,G
CerpassRx,,,N,0,406012501,HYDROcodone-Acetaminophen Oral Tablet 10-325 MG,10-325MG,,6.60E+13,HYDROCODONE-ACETAMINOPHEN TAB 10-325 MG,5/4/2023,100,,1131856,7,C,WALMART PHARMACY 10-1111,1572 ANDERSON HWY,HARTWELL,GA,30643,N,AWP,5.74,0.12193,-0.52924,25,G
CerpassRx,,,N,0,66993059502,Amphetamine-Dextroamphet ER Oral Capsule Extended ,10MG,,6.11E+13,AMPHETAMINE-DEXTROAMPHETAMINE CAP ER 24HR 10 MG,5/4/2023,30,,1131856,7,C,WALMART PHARMACY 10-1111,1572 ANDERSON HWY,HARTWELL,GA,30643,N,AWP,11.04,0.72358,-0.49142,30,G
CerpassRx,,,N,0,29300022019,Montelukast Sodium Oral Tablet 10 MG,10MG,,4.45E+13,MONTELUKAST SODIUM TAB 10 MG (BASE EQUIV),5/4/2023,30,,1131856,7,C,WALMART PHARMACY 10-1111,1572 ANDERSON HWY,HARTWELL,GA,30643,N,AWP,10.18,0.0633,4.36072,30,G
CerpassRx,,,N,0,65862059805,Tamsulosin HCl Oral Capsule 0.4 MG,0.4MG,,5.69E+13,TAMSULOSIN HCL CAP 0.4 MG,5/4/2023,30,,1131856,7,C,WALMART PHARMACY 10-1111,1572 ANDERSON HWY,HARTWELL,GA,30643,N,AWP,7.59,0.05588,3.52756,30,G
CerpassRx,,,N,0,68462030201,Indomethacin Oral Capsule 50 MG,50MG,,6.61E+13,INDOMETHACIN CAP 50 MG,5/4/2023,60,,1171228,7,C,WALGREENS #17697,192 FIRST AVENUE,EAST ELLIJAY,GA,30539,N,AWP,7.59,0.09584,0.31991,20,G
CerpassRx,,,N,0,68462026190,Rosuvastatin Calcium Oral Tablet 5 MG,5MG,,3.94E+13,ROSUVASTATIN CALCIUM TAB 5 MG,5/4/2023,30,,1125283,7,C,CVS PHARMACY #05613,21 NORTH CAROLINA ST,HARTWELL,GA,30643,N,AWP,26.84,0.04629,18.32743,30,G
CerpassRx,,,N,0,70377002711,Atorvastatin Calcium Oral Tablet 10 MG,10MG,,3.94E+13,ATORVASTATIN CALCIUM TAB 10 MG (BASE EQUIVALENT),5/5/2023,30,,1160770,7,C,CVS PHARMACY #02593,1193 US HIGHWAY 19 S,LEESBURG,GA,317634825,N,AWP,12.14,0.03206,11.62217,30,G
CerpassRx,,,N,0,43547042509,Losartan Potassium-HCTZ Oral Tablet 100-12.5 MG,100-12.5MG,,3.70E+13,LOSARTAN POTASSIUM & HYDROCHLOROTHIAZIDE TAB 100-12.5 MG,5/5/2023,30,,1160770,7,C,CVS PHARMACY #02593,1193 US HIGHWAY 19 S,LEESBURG,GA,317634825,N,AWP,10.22,0.1294,1.63266,30,G
CerpassRx,,,N,0,55111032101,Glimepiride Oral Tablet 2 MG,2MG,,2.72E+13,GLIMEPIRIDE TAB 2 MG,5/5/2023,30,,1170884,7,C,WALGREENS #19997,4242 NORTH SECOND STREET,FOLKSTON,GA,315373008,N,AWP,3.88,0.03834,2.37333,30,G
CerpassRx,,,N,0,378001805,Metoprolol Tartrate Oral Tablet 25 MG,25MG,,3.32E+13,METOPROLOL TARTRATE TAB 25 MG,5/5/2023,30,,1171696,7,C,WALGREENS #17548,100 WEST 3RD STREET,DONALSONVILLE,GA,398451506,N,AWP,1.44,0.01777,1.70118,30,G
CerpassRx,,,N,0,378001805,Metoprolol Tartrate Oral Tablet 25 MG,25MG,,3.32E+13,METOPROLOL TARTRATE TAB 25 MG,5/5/2023,30,,1171696,7,C,WALGREENS #17548,100 WEST 3RD STREET,DONALSONVILLE,GA,398451506,N,AWP,1.44,0.01671,1.87253,30,G
CerpassRx,,,N,0,23916360,Restasis Ophthalmic Emulsion 0.05 %,0.05%,,8.67E+13,CYCLOSPORINE (OPHTH) EMULSION 0.05%,5/5/2023,60,,1163459,7,C,UNADILLA DRUG COMPANY,413 SECOND ST,UNADILLA,GA,31091,N,AWP,653.9,10.31603,0.05645,30,B
CerpassRx,,,N,0,23916360,Restasis Ophthalmic Emulsion 0.05 %,0.05%,,8.67E+13,CYCLOSPORINE (OPHTH) EMULSION 0.05%,5/5/2023,60,,1163459,7,C,UNADILLA DRUG COMPANY,413 SECOND ST,UNADILLA,GA,31091,N,AWP,653.9,10.33963,0.05404,30,B
CerpassRx,,,N,0,65862052890,Venlafaxine HCl ER Oral Capsule Extended Release 2,75MG,,5.82E+13,VENLAFAXINE HCL CAP ER 24HR 75 MG (BASE EQUIVALENT),5/5/2023,30,,1151101,7,C,WALGREENS #7394,3740 CASCADE RD SW,ATLANTA,GA,303312108,N,AWP,27.78,0.10601,7.73502,30,G
CerpassRx,,,N,0,69680013393,Potassium Chloride ER Oral Tablet Extended Release,10MEQ,,7.97E+13,POTASSIUM CHLORIDE TAB ER 10 MEQ,5/5/2023,60,,1131856,7,C,WALMART PHARMACY 10-1111,1572 ANDERSON HWY,HARTWELL,GA,30643,N,AWP,0.86,0.13033,-0.89002,30,G
CerpassRx,,,N,0,65862021801,Cefdinir Oral Suspension Reconstituted 125 MG/5ML,125MG/5ML,,2.30E+12,CEFDINIR FOR SUSP 125 MG/5ML,5/5/2023,100,,1130967,7,C,CVS PHARMACY #07701,30 ORVIN LANCE CONNECTOR,BLUE RIDGE,GA,30513,N,AWP,9.2,0.1303,-0.29394,14,G
CerpassRx,,,N,0,68180072103,amLODIPine Besylate Oral Tablet 10 MG,10MG,,3.40E+13,AMLODIPINE BESYLATE TAB 10 MG (BASE EQUIVALENT),5/5/2023,30,,1156290,7,C,WALGREENS #10799,409 S COLUMBIA AVE,RINCON,GA,313269080,N,AWP,14.15,0.01717,26.47039,30,G
CerpassRx,,,N,0,65862096901,Eszopiclone Oral Tablet 3 MG,3MG,,6.02E+13,ESZOPICLONE TAB 3 MG,5/5/2023,30,,1153270,7,C,CVS PHARMACY #07888,6120 HICKORY FLAT HWY,CANTON,GA,30115,N,AWP,40.51,0.09786,12.79862,30,G
CerpassRx,,,N,0,31722070530,valACYclovir HCl Oral Tablet 1 GM,1GM,,1.24E+13,VALACYCLOVIR HCL TAB 1 GM,5/6/2023,30,,1146718,7,C,CVS PHARMACY #02504,2586 LAWRENCEVILLE HWY,DECATUR,GA,30033,N,AWP,43.92,0.50118,1.92111,30,G
CerpassRx,,,N,0,42192033001,NP Thyroid Oral Tablet 60 MG,60MG,,2.81E+13,THYROID TAB 60 MG (1 GRAIN),5/6/2023,30,,1172131,7,C,PUBLIX PHARMACY #1622,510 GA HIGHWAY 247 S,BONAIRE,GA,310053865,N,AWP,27.34,0.69271,0.31561,30,B
CerpassRx,,,N,0,55111018015,tiZANidine HCl Oral Tablet 4 MG,4MG,,7.51E+13,TIZANIDINE HCL TAB 4 MG (BASE EQUIVALENT),5/6/2023,21,,1160516,7,C,PUBLIX PHARMACY #1364,467 POOLER PARKWAY,POOLER,GA,31322,N,MAC,1.83,0.04512,0.93136,21,G
CerpassRx,,,N,0,70756020212,Amitriptyline HCl Oral Tablet 25 MG,25MG,,5.82E+13,AMITRIPTYLINE HCL TAB 25 MG,5/6/2023,60,,1137567,7,C,WALMART PHARMACY 10-0780,2050 WEST SPRING ST,MONROE,GA,30655,N,AWP,2.17,,,30,G
CerpassRx,,,N,0,93505698,Atorvastatin Calcium Oral Tablet 10 MG,10MG,,3.94E+13,ATORVASTATIN CALCIUM TAB 10 MG (BASE EQUIVALENT),5/6/2023,30,,1137567,7,C,WALMART PHARMACY 10-0780,2050 WEST SPRING ST,MONROE,GA,30655,N,AWP,13.5,0.03206,13.03618,30,G
CerpassRx,,,N,0,50111064801,FLUoxetine HCl Oral Capsule 20 MG,20MG,,5.82E+13,FLUOXETINE HCL CAP 20 MG,5/7/2023,30,,1155692,7,C,WALGREENS #9494,4397 SUDDERTH RD,SUGAR HILL,GA,305188794,N,AWP,15.89,0.03083,16.18024,30,G
CerpassRx,,,N,0,69238183107,Levothyroxine Sodium Oral Tablet 50 MCG,50MCG,,2.81E+13,LEVOTHYROXINE SODIUM TAB 50 MCG,5/7/2023,30,,1151341,7,C,KROGER DRUGSTORE #667,1476 TURNER MCCALL BLVD,ROME,GA,30161,N,MAC,2.97,0.0937,0.05656,30,G
CerpassRx,,,N,0,13668004501,lamoTRIgine Oral Tablet 25 MG,25MG,,7.26E+13,LAMOTRIGINE TAB 25 MG,5/7/2023,120,,1143027,7,C,CVS PHARMACY #02088,6716 MT ZION BLVD,MORROW,GA,30260,N,AWP,49.8,0.02829,13.66949,30,G
CerpassRx,,,N,0,69238131409,Pregabalin Oral Capsule 150 MG,150MG,,7.26E+13,PREGABALIN CAP 150 MG,5/7/2023,60,,1143027,7,C,CVS PHARMACY #02088,6716 MT ZION BLVD,MORROW,GA,30260,N,AWP,50.57,0.0665,11.67419,30,G
CerpassRx,,,N,0,78077720,Entresto Oral Tablet 49-51 MG,49-51MG,,4.10E+13,SACUBITRIL-VALSARTAN TAB 49-51 MG,5/7/2023,60,,1154791,7,C,WALMART PHARMACY 10-3402,1400 HUDSON BRIDGE ROAD,STOCKBRIDGE,GA,30281,N,AWP,645.26,10.68483,0.0065,30,B
CerpassRx,,,N,0,76385011350,Carvedilol Oral Tablet 25 MG,25MG,,3.33E+13,CARVEDILOL TAB 25 MG,5/7/2023,60,,1154791,7,C,WALMART PHARMACY 10-3402,1400 HUDSON BRIDGE ROAD,STOCKBRIDGE,GA,30281,N,U&C,4,0.03426,0.9459,30,G
CerpassRx,,,N,0,430042014,Lo Loestrin Fe Oral Tablet 1 MG-10 MCG / 10 MCG,1 MG-10 MCG /10 MCG,,2.60E+13,NORETHIN-ETH ESTRADIOL-FE TAB 1 MG-10 MCG (24)/10 MCG (2),5/7/2023,28,,1158547,7,C,PUBLIX PHARMACY #1251,916 LOGANVILLE HWY,BETHLEHEM,GA,30620,N,AWP,161.13,5.86332,-0.01854,28,B
CerpassRx,,,N,0,430042014,Lo Loestrin Fe Oral Tablet 1 MG-10 MCG / 10 MCG,1 MG-10 MCG /10 MCG,,2.60E+13,NORETHIN-ETH ESTRADIOL-FE TAB 1 MG-10 MCG (24)/10 MCG (2),5/7/2023,28,,1158547,7,C,PUBLIX PHARMACY #1251,916 LOGANVILLE HWY,BETHLEHEM,GA,30620,N,AWP,161.13,5.58406,0.03055,28,B
CerpassRx,,,N,0,574029201,aMILoride HCl Oral Tablet 5 MG,5MG,,3.75E+13,AMILORIDE HCL TAB 5 MG,5/7/2023,120,,1156290,7,C,WALGREENS #10799,409 S COLUMBIA AVE,RINCON,GA,313269080,N,AWP,6.36,0.18394,-0.71186,30,G
CerpassRx,,,N,0,65162019050,Naproxen Oral Tablet 500 MG,500MG,,6.61E+13,NAPROXEN TAB 500 MG,5/8/2023,60,,1133836,7,C,CVS PHARMACY #04671,3127 MACON RD,COLUMBUS,GA,31906,N,AWP,6.88,0.06368,0.80067,30,G
CerpassRx,,,N,0,52817018110,cloNIDine HCl Oral Tablet 0.2 MG,0.2MG,,3.62E+13,CLONIDINE HCL TAB 0.2 MG,5/8/2023,90,,1151341,7,C,KROGER DRUGSTORE #667,1476 TURNER MCCALL BLVD,ROME,GA,30161,N,MAC,6.47,0.03462,1.07651,30,G
CerpassRx,,,N,0,65862050320,Amoxicillin-Pot Clavulanate Oral Tablet 875-125 MG,875-125MG,,1.99E+12,AMOXICILLIN & K CLAVULANATE TAB 875-125 MG,5/8/2023,20,,1135688,7,C,CVS PHARMACY #05640,6327 HWY 53 EAST,DAWSONVILLE,GA,30534,N,AWP,10.14,0.32529,0.55861,10,G
CerpassRx,,,N,0,49483060450,Ibuprofen Oral Tablet 800 MG,800MG,,6.61E+13,IBUPROFEN TAB 800 MG,5/8/2023,20,,1135688,7,C,CVS PHARMACY #05640,6327 HWY 53 EAST,DAWSONVILLE,GA,30534,N,AWP,2.64,0.07416,0.77994,7,G
CerpassRx,,,N,0,68180032002,buPROPion HCl ER (XL) Oral Tablet Extended Release,300MG,,5.83E+13,BUPROPION HCL TAB ER 24HR 300 MG,5/8/2023,30,,1173462,7,C,LEE AND PICKELS DRUGS-TROUPEVILLE,19664 VALDOSTA HWY STE A,VALDOSTA,GA,316028300,N,MAC,7.77,0.14022,0.8471,30,G
CerpassRx,,,N,0,93342601,LORazepam Oral Tablet 1 MG,1MG,,5.71E+13,LORAZEPAM TAB 1 MG,5/8/2023,90,,1126134,7,C,QUICK RX DRUGS,504 N LAUREL ST,SPRINGFIELD,GA,31329,N,MAC,7.61,,,23,G
CerpassRx,,,N,0,3089421,Eliquis Oral Tablet 5 MG,5MG,,8.34E+13,APIXABAN TAB 5 MG,5/8/2023,60,,1163459,7,C,UNADILLA DRUG COMPANY,413 SECOND ST,UNADILLA,GA,31091,N,AWP,567.93,8.46451,0.11826,30,B
CerpassRx,,,N,0,3089421,Eliquis Oral Tablet 5 MG,5MG,,8.34E+13,APIXABAN TAB 5 MG,5/8/2023,60,,1163459,7,C,UNADILLA DRUG COMPANY,413 SECOND ST,UNADILLA,GA,31091,N,AWP,567.93,8.97238,0.05496,30,B
CerpassRx,,,N,0,115148601,Amphetamine-Dextroamphet ER Oral Capsule Extended ,5MG,,6.11E+13,AMPHETAMINE-DEXTROAMPHETAMINE CAP ER 24HR 5 MG,5/8/2023,90,,1148685,7,C,KROGER DRUGSTORE #437,3630 THOMPSON BRIDGE ROAD,GAINSVILLE,GA,30506,N,MAC,72.81,0.70327,0.15034,30,G
CerpassRx,,,N,0,59417010310,Vyvanse Oral Capsule 30 MG,30MG,,6.11E+13,LISDEXAMFETAMINE DIMESYLATE CAP 30 MG,5/8/2023,30,,1159222,7,C,PUBLIX PHARMACY #1286,5119 WASHINGTON RD.,EVANS,GA,30809,N,AWP,347.9,11.81769,-0.0187,30,B
CerpassRx,,,N,0,59417010310,Vyvanse Oral Capsule 30 MG,30MG,,6.11E+13,LISDEXAMFETAMINE DIMESYLATE CAP 30 MG,5/8/2023,30,,1159222,7,C,PUBLIX PHARMACY #1286,5119 WASHINGTON RD.,EVANS,GA,30809,N,AWP,347.9,11.25494,0.03036,30,B